Organisatieontologie voor de Verpleeghuiszorg
type: Ontology
version IRI: http://purl.org/ozo/onz-org#2.2.1
imports: http://purl.org/ozo/onz-g#2.2.0
created: 2020-04
creator: Marc Nieuwland
accrual periodicity: Nieuwe klassen, relaties en axioma's worden niet op specifieke datums toegevoegd. Bij wijzigingen en toevoegingen wordt halfjaarlijks een nieuwe versie van de ontologie gepubliceerd met een nieuw versienummer.
accrual policy: De ontwikkelaars van de ONZ-PERS besluiten over het toevoegen van nieuwe klassen, relaties, axioma's en individuals. Uitbreidingen en aanpassingen zijn gebaseerd op nieuwe competency questions zoals die worden geformuleerd en afgestemd met ketenpartijen betrokken bij informatie-uitwisseling in de verpleeghuiszorg.
contributor: Richard Dijkstra (RD), Roxane Segers (RS)
description: De Organisatieontologie voor de Verpleeghuiszorg (ONZ-ORG) is ontwikkeld binnen het KIK-V programma (2019-2023) geleid door het Zorginstituut Nederland. Doel van dit programma is uniforme gegevensuitwisseling voor het monitoren van de kwaliteit van de verpleeghuiszorg in Nederland. De ONZ-ORG is specifiek ontwikkeld voor het typeren van en queryen over brondata die in verpleeghuisorganisaties worden vastgelegd over vestigingen, afdelingen, adresgegevens, KvK-inschrijvingen, etcetera. De ONZ-ORG is een domeinontologie en importeert de ONZ-G als generieke ontologie.
language: http://lexvo.org/id/iso639-3/nld
license: https://mit-license.org
publisher: Zorginsituut Nederland (https://www.zorginstituutnederland.nl)
relation: The ONZ-ORG ontologie heeft geen expliciete relaties met externe bronnen op het niveau van klassen, properties of individuals.
type: http://omv.ontoware.org/2005/05/ontology#DomainOntology
editor note: Een organisatie heeft een structuur voor het uitvoeren van aktiviteiten en government voor management van deze aktiviteiteten. Dit treedt eigenlijk op bij alle operationele aktiviteiten en dus in andere modules zoals financieen en zorg. De keuze die voorligt is of een domein zijn eigen concepten voor operationele aktiviteiten krijgt of dat deze bij government en organisatie structuur worden opgenomen.
preferred namespace prefix: onz-org
preferred namespace uri: http://purl.org/ozo/onz-org
bug-database: https://gitlab.com/kik-v/ontologie/source/-/issues
repository: https://gitlab.com/kik-v/ontologie/source
comment: ONZ module voor organisatorische en government concepten.
backward compatible with: http://purl.org/ozo/onz-org#2.2.0
deprecated: false
prior version: http://purl.org/ozo/onz-org#2.2.0
version info: Van 2.2 naar 2.2.1: uitgebreid met metadata voor fairificatie door RS.
version info: 2.2.1
acronym: ONZ-ORG
browsing UI: https://kik-v.gitlab.io/ontologie/onz-org/
byte size: 50
definition property: definition
has representation language: http://dbpedia.org/resource/Web_Ontology_Language
has syntax: http://www.w3.org/ns/formats/RDF_XML
number of axioms: class restrictions: 33 subclassOf axioms: 21
number of classes: 21
number of data properties: 0
number of individuals: 41
number of object properties: 2
specializes: http://purl.org/ozo/onz-g#
used in project: Programma Keteninformatie Verpleeghuiszorg (https://www.kik-v.nl/)
vocabulary used: http://www.w3.org/2002/07/owl# http://www.w3.org/2000/01/rdf-schema# http://www.w3.org/1999/02/22-rdf-syntax-ns# http://www.w3.org/XML/1998/namespace http://www.w3.org/2001/XMLSchema# http://www.w3.org/2004/02/skos/core# http://purl.org/dc/elements/1.1/ http://purl.org/dc/terms/ http://xmlns.com/foaf/0.1/ https://w3id.org/mod# http://usefulinc.com/ns/doap# http://purl.org/vocab/vann/ http://vocab.deri.ie/void#

beheerd door
type: ObjectProperty
inverse of: beheert

beheert
type: ObjectProperty

heeft vestiging
type: ObjectProperty
inverse of: vestiging van
domain: Business
range: Vestiging

vestiging van
type: ObjectProperty
sub property of: inverseObjectProperty
domain: Vestiging
range: Business

Verblijfsobject
type: Class
subclass of: Restriction
  some values from: Class
    intersection of: LocalizableArea
    intersection of: Restriction
      some values from: Adres
      on property: identifiedBy
  on property: hasLocalizableArea
alternative label: Locatie

Business
type: Class
subclass of: Restriction
  some values from: Vestiging
  on property: heeft vestiging
definition source: Handelsregisterwet

Zorgkantoor
type: Class
subclass of: Restriction
  some values from: Zorgkantoor regio
  on property: hasOperatingRange

Gemeente
type: Class

Organisatie
type: Class

AGB-code
type: Class
subclass of: FormalIdentifier
subclass of: Restriction
  some values from: Class
    union of: Human
    union of: Organisatie
  on property: identifies
subclass of: Restriction
  some values from: string
  on property: hasDataValue
definition: Een AGB-code is een code om een registratie in het AGB-register te identificeren.

Adres
type: Class
subclass of: Address
subclass of: Restriction
  some values from: Nummeraanduiding
  on property: hasPart
subclass of: Restriction
  some values from: Roadway
  on property: isAbout
subclass of: Restriction
  some values from: VillageOrCity
  on property: isAbout
definition source: begrippenlijst
definition: Een adres is een door het bevoegde gemeentelijke orgaan aan een verblijfsobject, een standplaats of een ligplaats toegekende benaming, bestaande uit een combinatie van de naam van een openbare ruimte, een nummeraanduiding en de naam van een woonplaats.

Basisregistratie
type: Class
subclass of: Register
comment: Het Nederlandse kabinet heeft een aantal registraties aangewezen, waarvan de Nederlandse overheid meent dat daarin betrouwbaar alle vitale gegevens over burgers, bedrijven en instellingen gecentraliseerd kunnen worden opgeslagen. De verantwoordelijken voor het stelsel gaan ervan uit dat deze zogeheten "authentieke gegevens" een dermate hoge kwaliteit zullen hebben, dat de overheid deze gegevens zonder enig verder onderzoek in haar werk zal kunnen gebruiken.
definition: Een Register dat door de Nederlandse overheid is aangewezen als Basisregistratie.

Huisletter
type: Class
subclass of: LocalizablePlaceInformationObject
subclass of: Restriction
  some values from: string
  on property: hasDataValue
definition source: begrippenlijst
definition: Een huisletter is een authentiek gegeven met betrekking tot een nummeraanduiding. Het is de lettering van een adresseerbaar object.

Huisnummer
type: Class
subclass of: LocalizablePlaceInformationObject
subclass of: Restriction
  all values from: integer
  on property: hasDataValue
definition source: begrippenlijst

Huisnummertoevoeging
type: Class
subclass of: LocalizablePlaceInformationObject
subclass of: Restriction
  some values from: string
  on property: hasDataValue
definition source: begrippenlijst
definition: Een huisnummertoevoeging is een authentiek gegeven met betrekking tot een nummeraanduiding. Het is de toevoeging aan de nummering van een adresseerbaar object.

Inschrijving
type: Class
subclass of: SocialInformationObject
subclass of: Restriction
  some values from: Register
  on property: partOf
definition: Een Register is een lijst waarin gegevens over personen of zaken worden bijgehouden. Een Inschrijving is een individueel item op zo'n lijst en dus een deel van een Register.

Inschrijving in het AGB-register
type: Class
equivalent class: Class
  intersection of: Inschrijving
  intersection of: Restriction
    has value: AGB-Register
    on property: partOf
subclass of: Inschrijving
subclass of: Restriction
  some values from: AGB-code
  on property: hasPart
subclass of: Restriction
  some values from: Class
    union of: Human
    union of: Organisatie
  on property: isAbout
definition: Een Inschrijving die onderdeel is van het AGB-register

Inschrijving in het Handelsregister
type: Class
equivalent class: Class
  intersection of: Inschrijving
  intersection of: Restriction
    has value: Handelsregister
    on property: partOf
subclass of: Restriction
  some values from: Business
  on property: formallyDefines
subclass of: Restriction
  some values from: KVK-nummer
  on property: hasPart
subclass of: Restriction
  some values from: Vestigingsnummer
  on property: hasPart
definition: Een Inschrijving die onderdeel is van het Handelsregister.

KVK-nummer
type: Class
subclass of: FormalIdentifier
subclass of: Restriction
  some values from: Business
  on property: identifies
subclass of: Restriction
  some values from: string
  on property: hasDataValue
definition source: Handelsregisterwet
definition: Als je je bedrijf inschrijft in het Handelsregister krijg je een uniek 8-cijferig KVK-nummer. Een KVK-nummer laat zien dat je officieel ingeschreven staat bij KVK. En je dus formeel een bedrijf hebt.

Locatie
type: Class
subclass of: DependentStationaryArtifact
subclass of: Restriction
  some values from: Verblijfsobject
  on property: partOf
definition: Met locatie wordt een fysieke plek bedoeld, die onderdeel is van één Verblijfsobject. Voorbeeld: een verdieping of vleugel binnen een Verblijfsobject. Een verblijfsobject kan bestaan uit één of meerdere locaties. Een locatie kan niet meer dan één Verblijfsobject beslaan.

Nummeraanduiding
type: Class
subclass of: LocalizablePlaceInformationObject
subclass of: Restriction
  some values from: Huisletter
  on property: hasPart
subclass of: Restriction
  some values from: Huisnummer
  on property: hasPart
subclass of: Restriction
  some values from: Huisnummertoevoeging
  on property: hasPart
subclass of: Restriction
  some values from: Postcode
  on property: hasPart
definition source: begrippenlijst
definition: Een nummeraanduiding is een door het bevoegde gemeentelijke orgaan als zodanig toegekende aanduiding van een verblijfsobject, een standplaats of een ligplaats. Het is het samenstel van huisnummer, huisletter en huisnummertoevoeging.

Organisatorische eenheid
type: Class
subclass of: Organisatie
subclass of: Restriction
  some values from: Organisatie
  on property: partOf
alternative label: Afdeling
alternative label: Team
definition: Een groep binnen een organisatie die is gevormd ter behartiging van een specifieke organisatiedoelstelling.

Postcode
type: Class
subclass of: LocalizablePlaceInformationObject
subclass of: Restriction
  some values from: string
  on property: hasDataValue
definition source: begrippenlijst
definition: De postcode is een coderingssystematiek zoals ontwikkeld en beheerd door PostNL. Een postcode is een niet-authentiek gegeven met betrekking tot een nummeraanduiding.

Register
type: Class
subclass of: SocialInformationObject
alternative label: Registratie
definition: Lijst waarin gegevens over personen of zaken worden bijgehouden

Vestiging
type: Class
equivalent class: Class
  intersection of: Verblijfsobject
  intersection of: Restriction
    some values from: Vestigingrol
    on property: playsRole
subclass of: Verblijfsobject
subclass of: Restriction
  some values from: Business
  on property: vestiging van
definition source: Handelsregisterwet
definition: Een gebouw of complex van gebouwen waar duurzame uitoefening van de activiteiten van een onderneming of rechtspersoon plaatsvindt.

Vestigingrol
type: Class
subclass of: SocialRole
subclass of: Restriction
  some values from: Verblijfsobject
  on property: isRolePlayedBy
definition: De rol die ingevuld kan worden door een Verblijfsobject, wanneer dat Verblijfsobject in het Handelsregister wordt opgenomen als Vestiging van een Organisatie.

Vestigingsnummer
type: Class
subclass of: FormalIdentifier
subclass of: Restriction
  some values from: Vestiging
  on property: identifies
subclass of: Restriction
  some values from: string
  on property: hasDataValue
definition source: Handelsregisterwet
definition: Elke vestiging van een onderneming of rechtspersoon in het Handelsregister heeft een uniek vestigingsnummer van 12 cijfers.

Wooneenheid
type: Class
subclass of: DependentStationaryArtifact
subclass of: Restriction
  some values from: Room
  on property: hasPart
subclass of: Restriction
  some values from: Restriction
    some values from: Restriction
      some values from: Human
      on property: hasCapacityObject
    on property: hasQualityValue
  on property: hasQuality
subclass of: Restriction
  some values from: Verblijfsobject
  on property: partOf
definition: Een wooneenheid is het samenstel van één, of meerdere kamer of ruimtes (onz-g:Room), die samen geschikt zijn voor bewoning en geen kleinere wooneenheden bevat. Een wooneenheid betreft dus de kleinste eenheid geschikt voor bewoning. Een lokatie met meerdere wooneenheden wordt op zichzelf dus niet beschouwd als een wooneenheid, ook al biedt die lokatie wel de mogelijkheid om er te wonen. De nadruk bij dit concept ligt derhalve op het begrip ’–eenheid’.

Woonplaats
type: Class
subclass of: VillageOrCity
subclass of: Restriction
  some values from: Gemeente
  on property: partOf
definition source: Woonplaats
editor note: Aangemaakt als subklasse van 'DorpOfStad' om te verwijzen naar de specifieke definitie volgens het Kadaster zoals dat in Nederland wordt gehanteerd. De bredere klasse DorpOfStad refereert dus naar het bredere begrip dat ook buiten Nederland geldigheid heeft.
definition: Een woonplaats is een door het bevoegde gemeentelijke orgaan als zodanig aangewezen en van een naam voorzien gedeelte van het grondgebied van de gemeente.

Zorgkantoor regio
type: Class
subclass of: AdministrativeRegion
subclass of: Restriction
  some values from: Gemeente
  on property: hasPart
subclass of: Restriction
  some values from: Zorgkantoor
  on property: isOperatingRangeOf
comment: Nederland is verdeeld in 31 zorgkantoorregio’s. Elke regio heeft zijn eigen zorgkantoor. Zorgkantoren werken zelfstandig en zijn gekoppeld aan de grootste zorgverzekeraar in die regio.

Amstelland en De Meerlanden
type: NamedIndividual
type: Zorgkantoor regio

Amsterdam
type: NamedIndividual
type: Zorgkantoor regio

Apeldoorn/Zutphen
type: NamedIndividual
type: Zorgkantoor regio

Arnhem
type: NamedIndividual
type: Zorgkantoor regio

Drenthe
type: NamedIndividual
type: Zorgkantoor regio

Flevoland
type: NamedIndividual
type: Zorgkantoor regio

Friesland
type: NamedIndividual
type: Zorgkantoor regio

Groningen
type: NamedIndividual
type: Zorgkantoor regio

Haaglanden
type: NamedIndividual
type: Zorgkantoor regio

Kennemerland
type: NamedIndividual
type: Zorgkantoor regio

Midden-Brabant
type: NamedIndividual
type: Zorgkantoor regio

Midden-Holland
type: NamedIndividual
type: Zorgkantoor regio

Midden-IJssel
type: NamedIndividual
type: Zorgkantoor regio

Nijmegen
type: NamedIndividual
type: Zorgkantoor regio

Noord- en Midden- Limburg
type: NamedIndividual
type: Zorgkantoor regio

Noord-Holland-Noord
type: NamedIndividual
type: Zorgkantoor regio

Noordoost-Brabant
type: NamedIndividual
type: Zorgkantoor regio

Rotterdam
type: NamedIndividual
type: Zorgkantoor regio

't Gooi
type: NamedIndividual
type: Zorgkantoor regio

Twente
type: NamedIndividual
type: Zorgkantoor regio

Utrecht
type: NamedIndividual
type: Zorgkantoor regio

Waardenland
type: NamedIndividual
type: Zorgkantoor regio

West-Brabant
type: NamedIndividual
type: Zorgkantoor regio

Zaanstreek/Waterland
type: NamedIndividual
type: Zorgkantoor regio

Zeeland
type: NamedIndividual
type: Zorgkantoor regio

Zuid-Holland-Noord
type: NamedIndividual
type: Zorgkantoor regio

Zuid-Hollandse Eilanden
type: NamedIndividual
type: Zorgkantoor regio

Zuidoost-Brabant
type: NamedIndividual
type: Zorgkantoor regio

Zuid-Limburg
type: NamedIndividual
type: Zorgkantoor regio

Zwolle
type: NamedIndividual
type: Zorgkantoor regio

Westland Schieland Delfland
type: NamedIndividual
type: Zorgkantoor regio

AGB-Register
type: NamedIndividual
type: Register
definition: Het AGB-register is een register waarin alle noodzakelijke (zorg)informatie staat om declareren en het afsluiten van contracten tussen zorgverzekeraars en zorgaanbieders mogelijk te maken. Ook is de informatie uit het AGB-register de basis voor zorgzoekers en zorgvinders voor verzekerden en patiënten. Vektis beheert het AGB-register.

Handelsregister
type: NamedIndividual
type: Basisregistratie
definition: Het Handelsregister is een door de overheid gehouden register, waarin rechtspersonen en ondernemingen vermeld staan met hun gegevens.

Zorgkantoor CZ
type: NamedIndividual
type: Zorgkantoor
beheert: Haaglanden
beheert: West-Brabant
beheert: Zeeland
beheert: Zuid-Hollandse Eilanden
beheert: Zuidoost-Brabant
beheert: Zuid-Limburg

Zorgkantoor DSW
type: NamedIndividual
type: Zorgkantoor
beheert: Westland Schieland Delfland

Zorgkantoor Friesland
type: NamedIndividual
type: Zorgkantoor
beheert: Friesland

Zorgkantoor Menzis
type: NamedIndividual
type: Zorgkantoor
beheert: Arnhem
beheert: Groningen
beheert: Twente

Zorgkantoor Midden IJssel
type: NamedIndividual
type: Zorgkantoor
beheert: Midden-IJssel

Zorgkantoor VGZ
type: NamedIndividual
type: Zorgkantoor
beheert: Midden-Brabant
beheert: Midden-Holland
beheert: Nijmegen
beheert: Noord- en Midden- Limburg
beheert: Noord-Holland-Noord
beheert: Noordoost-Brabant
beheert: Waardenland

Zorgkantoor Zilveren Kruis
type: NamedIndividual
type: Zorgkantoor
beheert: Apeldoorn/Zutphen
beheert: Drenthe
beheert: Flevoland
beheert: Kennemerland
beheert: Rotterdam
beheert: 't Gooi
beheert: Utrecht
beheert: Zaanstreek/Waterland
beheert: Zwolle

Zorgkantoor Zorg en Zekerheid
type: NamedIndividual
type: Zorgkantoor
beheert: Amstelland en De Meerlanden
beheert: Amsterdam
beheert: Zuid-Holland-Noord